Target
RAF proto-oncogene serine/threonine-protein kinase [Y340D,Y341D]
Ligand
BDBM373010
Substrate
Meas. Tech.
Time-Resolved Fluorescence Energy Transfer Assay
IC50
<0.250±n/a nM
Citation
 Zhou, CWang, SZhang, G Fused tricyclic compounds as Raf kinase inhibitors US Patent  US9895376 Publication Date 2/20/2018 
Target
Name:
RAF proto-oncogene serine/threonine-protein kinase [Y340D,Y341D]
Synonyms:
C-RAF (Y340D Y341D) RAF proto-oncogene serine/threonine-protein kinase (Y340D/Y341D) RAF1 | RAF1_HUMAN
Type:
Serine/threonine-protein kinase
Mol. Mass.:
72984.33
Organism:
Homo sapiens (Human)
Description:
P04049 Y340D Y341D
Residue:
648
  
Inhibitor
Name:
BDBM373010
Synonyms:
US9895376, Compound 2.30
Type:
Small organic molecule
Emp. Form.:
C26H20N2O6
Mol. Mass.:
456.4468
SMILES:
O=C(COC(=O)C1C2Oc3ccc(Oc4ccnc5NC(=O)CCc45)cc3C12)c1ccccc1
: