Target
Serine/threonine-protein kinase B-raf [V600E]
Ligand
BDBM210023
Substrate
Meas. Tech.
Time-Resolved Fluorescence Energy Transfer Assay
IC50
3.30±n/a nM
Citation
 Zhou, CWang, SZhang, G Fused tricyclic compounds as Raf kinase inhibitors US Patent  US9895376 Publication Date 2/20/2018 
Target
Name:
Serine/threonine-protein kinase B-raf [V600E]
Synonyms:
B-RAF V600E B-Raf Protein Kinase Mutant (V600E) BRAF BRAF mutant V600E BRAF_HUMAN Protein mono-ADP-ribosyltransferase (PARP3) RAFB1 Serine/threonine-protein kinase B-raf (V600E) V-RAF murine sarcoma viral oncogene homologue B1 mutant (BRAF V600E)
Type:
Mol. Mass.:
84474.98
Organism:
Homo sapiens (Human)
Description:
P15056 V600E
Residue:
766
  
Inhibitor
Name:
BDBM210023
Synonyms:
US10576087, Compound 2.32 US9895376, Compound 2.32
Type:
Small organic molecule
Emp. Form.:
C26H19ClN4O3
Mol. Mass.:
470.907
SMILES:
Clc1ccccc1-c1c[nH]c(n1)C1C2Oc3ccc(Oc4ccnc5NC(=O)CCc45)cc3C12
: