Target
RAF proto-oncogene serine/threonine-protein kinase [Y340D,Y341D]
Ligand
BDBM210025
Substrate
Meas. Tech.
Time-Resolved Fluorescence Energy Transfer Assay
IC50
4.20±n/a nM
Citation
 Zhou, CWang, SZhang, G Fused tricyclic compounds as Raf kinase inhibitors US Patent  US9895376 Publication Date 2/20/2018 
Target
Name:
RAF proto-oncogene serine/threonine-protein kinase [Y340D,Y341D]
Synonyms:
C-RAF (Y340D Y341D) RAF proto-oncogene serine/threonine-protein kinase (Y340D/Y341D) RAF1 | RAF1_HUMAN
Type:
Serine/threonine-protein kinase
Mol. Mass.:
72984.33
Organism:
Homo sapiens (Human)
Description:
P04049 Y340D Y341D
Residue:
648
  
Inhibitor
Name:
BDBM210025
Synonyms:
US10576087, Compound 2.34 US9895376, Compound 2.34
Type:
Small organic molecule
Emp. Form.:
C27H21F3N4O4
Mol. Mass.:
522.4752
SMILES:
OCCn1c(nc2cc(ccc12)C(F)(F)F)C1C2Oc3ccc(Oc4ccnc5NC(=O)CCc45)cc3C12
: