Target
Tyrosine-protein kinase ABL1 [64-515]
Ligand
BDBM230753
Substrate
Meas. Tech.
Radiometric Filter-Binding Assay
IC50
<3.00±n/a nM
Citation
 Furet, PGrotzfeld, RMJahnke, WJones, DManley, PWMarzinzik, APelle, XFSalem, BSchoepfer, J Benzamide derivatives for inhibiting the activity of ABL1, ABL2 and BCR-ABL1 US Patent  US9896444 Publication Date 2/20/2018 
Target
Name:
Tyrosine-protein kinase ABL1 [64-515]
Synonyms:
ABL ABL1_HUMAN Tyrosine-protein kinase ABL1 Tyrosine-protein kinase ABL1 (ABL) | Tyrosine-protein kinase ABL1 (ABL1)
Type:
Enzyme Catalytic Domain
Mol. Mass.:
51539.77
Organism:
Homo sapiens (Human)
Description:
aa 64-515
Residue:
452
  
Inhibitor
Name:
BDBM230753
Synonyms:
US9340537, 7 | US9896444, Example 7
Type:
Small organic molecule
Emp. Form.:
C21H18F3N3O4
Mol. Mass.:
433.3805
SMILES:
O[C@@H]1CCN(C1)c1ncc(cc1-c1ccoc1)C(=O)Nc1ccc(OC(F)(F)F)cc1
: