Target
Orexin receptor type 2
Ligand
BDBM373352
Substrate
Meas. Tech.
Cell-based Functional Assay
IC50
1800±n/a nM
Citation
 Kamenecka, TMHe, YNguyen, WJiang, RSong, XHerr, RJJiang, Q Substituted prolines/piperidines as orexin receptor antagonists US Patent  US9896452 Publication Date 2/20/2018 
Target
Name:
Orexin receptor type 2
Synonyms:
HCRTR2 OX2R_HUMAN Orexin receptor type 2 (OR-2) Orexin receptor type 2 (OX2R) Ox-2-R | Ox2-R
Type:
Protein
Mol. Mass.:
50710.53
Organism:
Homo sapiens (Human)
Description:
O43614
Residue:
444
  
Inhibitor
Name:
BDBM373352
Synonyms:
((2S,3R)-3-Methyl-2-(((5-(trifluoromethyl)pyridin-2-yl)amino)methyl)piperidin-1-yl)(5-methyl-2-(3-methyl-1H-pyrazol-1-yl)phenyl)methanone | US9896452, Ex. A108
Type:
Small organic molecule
Emp. Form.:
C25H28F3N5O
Mol. Mass.:
471.5179
SMILES:
C[C@@H]1CCCN([C@@H]1CNc1ccc(cn1)C(F)(F)F)C(=O)c1cc(C)ccc1-n1ccc(C)n1
: