Target
cAMP and cAMP-inhibited cGMP 3',5'-cyclic phosphodiesterase 10A
Ligand
BDBM194418
Substrate
Meas. Tech.
Homogenous Time-Resolved Fluorescence Resonance Energy Transfer (TR-FRET) Technology
IC50
4.60±n/a nM
Citation
 Leblond, BTaverne, TChauvignac, CBeausoleil, ECasagrande, ADesire, LPando, MPDonello, JEYang, R Substituted 6, 7-dialkoxy-3-isoquinoline derivatives as inhibitors of phosphodiesterase 10 (PDE 10A) US Patent  US9902710 Publication Date 2/27/2018 
Target
Name:
cAMP and cAMP-inhibited cGMP 3',5'-cyclic phosphodiesterase 10A
Synonyms:
3',5'-cyclic phosphodiesterase PDE10A Phosphodiesterase 10 (PDE10) | Phosphodiesterase 10A
Type:
Protein
Mol. Mass.:
88412.52
Organism:
Homo sapiens (Human)
Description:
Q9Y233
Residue:
1055
  
Inhibitor
Name:
BDBM194418
Synonyms:
US9200016, 100 | US9902710, Compound 100
Type:
Small organic molecule
Emp. Form.:
C23H24N4O4S
Mol. Mass.:
452.526
SMILES:
CCc1ncc(Cc2cnc3ccc(NS(N)(=O)=O)cc3c2)c2cc(OC)c(OC)cc12
: