Target
Epidermal growth factor receptor
Ligand
BDBM373723
Substrate
Meas. Tech.
Kinase assay
IC50
550±n/a nM
Citation
 Mansour, TS 1,2-dithiolane and dithiol compounds useful in treating mutant EGFR-mediated diseases and conditions US Patent  US10246444 Publication Date 4/2/2019 
Target
Name:
Epidermal growth factor receptor
Synonyms:
EGF Receptor Substrate EGFR_HUMAN ERBB1 Epidermal Growth Factor Receptor erbB-1 Epidermal growth factor receptor (EGFR) HER1 Proto-oncogene c-ErbB-1 Tyrosine-Protein Kinase ErbB-1
Type:
Receptor Kinase Domain
Mol. Mass.:
134279.59
Organism:
Homo sapiens (Human)
Description:
P00533
Residue:
1210
  
Inhibitor
Name:
BDBM373723
Synonyms:
US10246444, Example 90
Type:
Small organic molecule
Emp. Form.:
C31H28ClFN4O5S2
Mol. Mass.:
655.159
SMILES:
OC[C@@H](O)COc1cc2ncc(C#N)c(Nc3ccc(OCc4cccc(F)c4)c(Cl)c3)c2cc1NC(=O)CC1CSSC1
: