Target
Epidermal growth factor receptor [1-745,747-749,751-1210]
Ligand
BDBM373723
Substrate
Meas. Tech.
Kinase assay
IC50
5500±n/a nM
Citation
 Mansour, TS 1,2-dithiolane and dithiol compounds useful in treating mutant EGFR-mediated diseases and conditions US Patent  US10246444 Publication Date 4/2/2019 
Target
Name:
Epidermal growth factor receptor [1-745,747-749,751-1210]
Synonyms:
EGFR EGFR_HUMAN ERBB1 HER1
Type:
Enzyme Catalytic Domain
Mol. Mass.:
134080.40
Organism:
Homo sapiens (Human)
Description:
P00533[1-745,747-749,751-1210]
Residue:
1208
  
Inhibitor
Name:
BDBM373723
Synonyms:
US10246444, Example 90
Type:
Small organic molecule
Emp. Form.:
C31H28ClFN4O5S2
Mol. Mass.:
655.159
SMILES:
OC[C@@H](O)COc1cc2ncc(C#N)c(Nc3ccc(OCc4cccc(F)c4)c(Cl)c3)c2cc1NC(=O)CC1CSSC1
: