Target
Receptor tyrosine-protein kinase erbB-2
Ligand
BDBM373723
Substrate
Meas. Tech.
Kinase assay
IC50
550±n/a nM
Citation
 Mansour, TS 1,2-dithiolane and dithiol compounds useful in treating mutant EGFR-mediated diseases and conditions US Patent  US10246444 Publication Date 4/2/2019 
Target
Name:
Receptor tyrosine-protein kinase erbB-2
Synonyms:
2.7.10.1 CD_antigen=CD340 ERBB2_HUMAN FASN/HER2 HER2 MLN19 NEU Proto-oncogene Neu Tyrosine kinase-type cell surface receptor HER2 | p185erbB2
Type:
Mol. Mass.:
137894.47
Organism:
Homo sapiens (Human)
Description:
P04626
Residue:
1255
  
Inhibitor
Name:
BDBM373723
Synonyms:
US10246444, Example 90
Type:
Small organic molecule
Emp. Form.:
C31H28ClFN4O5S2
Mol. Mass.:
655.159
SMILES:
OC[C@@H](O)COc1cc2ncc(C#N)c(Nc3ccc(OCc4cccc(F)c4)c(Cl)c3)c2cc1NC(=O)CC1CSSC1
: