Target
Receptor tyrosine-protein kinase erbB-4
Ligand
BDBM373723
Substrate
Meas. Tech.
Kinase assay
IC50
50±n/a nM
Citation
 Mansour, TS 1,2-dithiolane and dithiol compounds useful in treating mutant EGFR-mediated diseases and conditions US Patent  US10246444 Publication Date 4/2/2019 
Target
Name:
Receptor tyrosine-protein kinase erbB-4
Synonyms:
ERBB4 Epidermal growth factor receptor ErbB-4 (HER4) Tyrosine Kinase Proto-oncogene c-ErbB-4 Receptor protein-tyrosine kinase erbB-4 Tyrosine kinase-type cell surface receptor HER4 (HER4)
Type:
Protein
Mol. Mass.:
146803.56
Organism:
Homo sapiens (Human)
Description:
Q15303
Residue:
1308
  
Inhibitor
Name:
BDBM373723
Synonyms:
US10246444, Example 90
Type:
Small organic molecule
Emp. Form.:
C31H28ClFN4O5S2
Mol. Mass.:
655.159
SMILES:
OC[C@@H](O)COc1cc2ncc(C#N)c(Nc3ccc(OCc4cccc(F)c4)c(Cl)c3)c2cc1NC(=O)CC1CSSC1
: