Target
Sodium channel protein type 5 subunit alpha
Ligand
BDBM373799
Substrate
Meas. Tech.
Sodium Influx Assay (In Vitro Assay)
IC50
>30000±n/a nM
Citation
 Andrez, JBurford, KNChowdhury, SCohen, CJDehnhardt, CMDevita, RJEmpfield, JRFocken, TGrimwood, MEHasan, SAJohnson, Jr., JPZenova, AY Benzenesulfonamide compounds and their use as therapeutic agents US Patent  US10246453 Publication Date 4/2/2019 
Target
Name:
Sodium channel protein type 5 subunit alpha
Synonyms:
HH1 SCN5A_HUMAN Sodium channel protein type 5 subunit alpha/beta-1/beta-2 Voltage-gated sodium channel subunit alpha Nav1.5
Type:
Enzyme
Mol. Mass.:
226908.60
Organism:
Homo sapiens (Human)
Description:
Q14524
Residue:
2016
  
Inhibitor
Name:
BDBM373799
Synonyms:
(R)-4-((1-benzylpyrrolidin-3-yl)amino)-3-chloro-N-(1,2,4-thiadiazol-5-yl)benzenesulfonamide 2,2,2-trifluoroacetate US10662184, Example 66 US11299490, Example 66
Type:
Small organic molecule
Emp. Form.:
C19H20ClN5O2S2
Mol. Mass.:
449.977
SMILES:
Clc1cc(ccc1N[C@@H]1CCN(Cc2ccccc2)C1)S(=O)(=O)Nc1ncns1
: