Target
Sodium channel protein type 8 subunit alpha
Ligand
BDBM373839
Substrate
Meas. Tech.
Sodium Influx Assay (In Vitro Assay)
IC50
99.0±n/a nM
Citation
 Andrez, JBurford, KNChowdhury, SCohen, CJDehnhardt, CMDevita, RJEmpfield, JRFocken, TGrimwood, MEHasan, SAJohnson, Jr., JPZenova, AY Benzenesulfonamide compounds and their use as therapeutic agents US Patent  US10246453 Publication Date 4/2/2019 
Target
Name:
Sodium channel protein type 8 subunit alpha
Synonyms:
MED SCN8A_HUMAN Sodium channel protein type 8 subunit alpha Voltage-gated sodium channel subunit alpha Nav1.6 | ep nav1.6
Type:
PROTEIN
Mol. Mass.:
225271.59
Organism:
Homo sapiens (Human)
Description:
ChEMBL_1516902
Residue:
1980
  
Inhibitor
Name:
BDBM373839
Synonyms:
4-((1-benzylpiperidin-4-yl)oxy)-2,6-difluoro-3-methyl-N-(thiazol-4-yl)benzenesulfonamide formate US10662184, Example 106 | US11299490, Example 106
Type:
Small organic molecule
Emp. Form.:
C22H23F2N3O3S2
Mol. Mass.:
479.563
SMILES:
Cc1c(F)c(c(F)cc1OC1CCN(Cc2ccccc2)CC1)S(=O)(=O)Nc1cscn1
: