Target
Fibroblast growth factor receptor 1
Ligand
BDBM261989
Substrate
Meas. Tech.
FGFR Enzymatic Assay (pre-incubated for 4 hours)
IC50
<10±n/a nM
Citation
 Sokolsky, AWu, LYao, W Bicyclic heterocycles as FGFR4 inhibitors US Patent  US10251892 Publication Date 4/9/2019 
Target
Name:
Fibroblast growth factor receptor 1
Synonyms:
BFGFR Basic fibroblast growth factor receptor 1 (FGFR1) CEK FGFR-1 FGFR-1, (FL) FGFR1_HUMAN FLT2 Fibroblast growth factor receptor 1 (FGFR-1) Fms-like tyrosine kinase 2 N-sam bFGF-R | c-fgr
Type:
Receptor
Mol. Mass.:
91861.70
Organism:
Homo sapiens (Human)
Description:
P11362
Residue:
822
  
Inhibitor
Name:
BDBM261989
Synonyms:
3-(2,6-difluoro-3,5- dimethoxyphenyl)-7-(1,3- dimethyl-1H-pyrazol-4-yl)-1- (pyridazin-3-ylmethyl)-3,4- dihydropyrido[4,3-d]pyrimidin- 2(1H)-one US10632126, Example 88 US9708318, 88
Type:
Small organic molecule
Emp. Form.:
C25H23F2N7O3
Mol. Mass.:
507.492
SMILES:
COc1cc(OC)c(F)c(N2Cc3cnc(cc3N(Cc3cccnn3)C2=O)-c2cn(C)nc2C)c1F
: