Target
Fibroblast growth factor receptor 2
Ligand
BDBM262051
Substrate
Meas. Tech.
FGFR Enzymatic Assay (pre-incubated for 4 hours)
IC50
<10±n/a nM
Citation
 Sokolsky, AWu, LYao, W Bicyclic heterocycles as FGFR4 inhibitors US Patent  US10251892 Publication Date 4/9/2019 
Target
Name:
Fibroblast growth factor receptor 2
Synonyms:
BEK FGFR-2 FGFR2 Fibroblast growth factor receptor 2 (FGFR2) KGFR Keratinocyte growth factor receptor VEGF-receptor 2 and Fibroblast growth factor receptor 2
Type:
Enzyme
Mol. Mass.:
92015.45
Organism:
Homo sapiens (Human)
Description:
P21802
Residue:
821
  
Inhibitor
Name:
BDBM262051
Synonyms:
3-(2,6-difluoro-3,5- dimethoxyphenyl)-1-ethyl-7-(1- methyl-1H-pyrazol-4-yl)-3,4- dihydropyrido[4,3-d]pyrimidin-2(1H)- one US10632126, Example 169 US9708318, 169
Type:
Small organic molecule
Emp. Form.:
C21H21F2N5O3
Mol. Mass.:
429.4199
SMILES:
CCN1C(=O)N(Cc2cnc(cc12)-c1cnn(C)c1)c1c(F)c(OC)cc(OC)c1F
: