Target
Histamine H4 receptor
Ligand
BDBM22866
Substrate
BDBM7966
Meas. Tech.
H4R Radioligand Binding Assay
pH
7.4±n/a
Temperature
310.15±n/a K
Ki
>10000±n/a nM
Comments
Analysis of the [3H]histamine saturation binding yielded a Kd value of 11 +/- 1 and a Bmax value of 1.8 +/- 0.4 pmol/mg protein.
Citation
 Lim, HDvan Rijn, RMLing, PBakker, RAThurmond, RLLeurs, R Evaluation of histamine H1-, H2-, and H3-receptor ligands at the human histamine H4 receptor: identification of 4-methylhistamine as the first potent and selective H4 receptor agonist. J Pharmacol Exp Ther 314:1310-21 (2005)  
Target
Name:
Histamine H4 receptor
Synonyms:
AXOR35 GPCR105 HH4R HRH4 Histamine H4 receptor Histamine receptor (H3 and H4) SP9144
Type:
G Protein-Coupled Receptor (GPCR)
Mol. Mass.:
44517.02
Organism:
Homo sapiens (Human)
Description:
Binding assays were using CHO cells stably expressing hH4R receptors.
Residue:
390
  
Inhibitor
Name:
BDBM22866
Synonyms:
2-(1,3-thiazol-2-yl)ethan-1-amine 2-(2-aminoethyl)thiazole TEA
Type:
Small organic molecule
Emp. Form.:
C5H8N2S
Mol. Mass.:
128.195
SMILES:
NCCc1nccs1
:
Substrate
Name:
BDBM7966
Synonyms:
2-(1H-imidazol-4-yl)ethan-1-amine CHEMBL90 Ergotidine Histamine Peremin | [3H]histamine
Type:
Small organic molecule
Emp. Form.:
C5H9N3
Mol. Mass.:
111.1451
SMILES:
NCCc1cnc[nH]1
: