Target
G protein-coupled receptor kinase 6
Ligand
BDBM23411
Substrate
Meas. Tech.
TBD
IC50
6610±n/a nM
Citation
 Stewart, AKPlekhov, AGreenhouse, R Inhibiting G protein coupled receptor 6 kinase polypeptides US Patent  US10252984 Publication Date 4/9/2019 
Target
Name:
G protein-coupled receptor kinase 6
Synonyms:
GPRK6 GRK6_HUMAN
Type:
PROTEIN
Mol. Mass.:
66001.83
Organism:
Homo sapiens (Human)
Description:
ChEMBL_793895
Residue:
576
  
Inhibitor
Name:
BDBM23411
Synonyms:
5,6,7-trihydroxy-2-(4-hydroxyphenyl)-4H-chromen-4-one Scutellarein Scutellarein (28) | US10252984, Table 2.2
Type:
flavone
Emp. Form.:
C15H10O6
Mol. Mass.:
286.2363
SMILES:
Oc1ccc(cc1)-c1cc(=O)c2c(O)c(O)c(O)cc2o1
: