Target
Adenosine receptor A2a
Ligand
BDBM375226
Substrate
Meas. Tech.
Adenosine A2B Receptor Subtype Competition Radioligand Binding Assay
Ki
>5000±n/a nM
Citation
 Castro-Palomino Laria, JCCamacho Gómez, JAMendoza Lizaldez, A Derivatives of 2-aminopyridine as adenosine A2B receptor antagonists and ligands of the melatonin MT3 receptors US Patent  US10253017 Publication Date 4/9/2019 
Target
Name:
Adenosine receptor A2a
Synonyms:
A2A adenosine receptor (hA2A) ADENOSINE A2 ADORA2 Adenosine A2A receptor (A2AAR)
Type:
G Protein-Coupled Receptor (GPCR)
Mol. Mass.:
44716.46
Organism:
Homo sapiens (Human)
Description:
P29274
Residue:
412
  
Inhibitor
Name:
BDBM375226
Synonyms:
5-(3-fluoropyridin-4-yl)-6-(pyridin-4-yl)pyridin-2-amine | US10253017, Example 11
Type:
Small organic molecule
Emp. Form.:
C15H11FN4
Mol. Mass.:
266.273
SMILES:
Nc1ccc(-c2ccnc(F)c2)c(n1)-c1ccncc1
: