Target
Adenosine receptor A2b
Ligand
BDBM375228
Substrate
Meas. Tech.
Adenosine A2B Receptor Subtype Competition Radioligand Binding Assay
Ki
46.1±n/a nM
Citation
 Castro-Palomino Laria, JCCamacho Gómez, JAMendoza Lizaldez, A Derivatives of 2-aminopyridine as adenosine A2B receptor antagonists and ligands of the melatonin MT3 receptors US Patent  US10253017 Publication Date 4/9/2019 
Target
Name:
Adenosine receptor A2b
Synonyms:
AA2BR_HUMAN ADORA2B Adenosine receptors A2b | Adenosine receptors; A2a & A2b
Type:
G Protein-Coupled Receptor (GPCR)
Mol. Mass.:
36341.22
Organism:
Homo sapiens (Human)
Description:
Residue:
332
  
Inhibitor
Name:
BDBM375228
Synonyms:
3-bromo-6-(pyridin-3-yl)-5-(pyridin-4-yl)pyridin-2-amine | US10253017, Example 22
Type:
Small organic molecule
Emp. Form.:
C15H11BrN4
Mol. Mass.:
327.179
SMILES:
Nc1cc(Br)c(-c2ccncc2)c(n1)-c1cccnc1
: