Target
Inhibitor of nuclear factor kappa-B kinase subunit epsilon
Ligand
BDBM277931
Substrate
Meas. Tech.
Biological Assays for TBK1 and IKKe
IC50
1.000±n/a nM
Citation
 Du, ZGuerrero, JAKaplan, JAKnox, Jr., JELo, JRMitchell, SANaduthambi, DPhillips, BWVenkataramani, CWang, PWatkins, WJZhao, Z Tank-binding kinase inhibitor compounds US Patent  US10253019 Publication Date 4/9/2019 
Target
Name:
Inhibitor of nuclear factor kappa-B kinase subunit epsilon
Synonyms:
I kappa-B kinase epsilon I-kappa-B kinase epsilon (IKK-E) IKBKE IKK-epsilon IKKE IKKI KIAA0151 | von Hippel-Lindau disease tumor suppressor/Inhibitor of nuclear factor kappa-B kinase subunit epsilon
Type:
Serine/threonine-protein kinase
Mol. Mass.:
80475.98
Organism:
Homo sapiens (Human)
Description:
Kinase inhibitory activity was determined using recombinant human IKK-epsilon expressed in baculovirus as a FLAG-tagged fusion protein.
Residue:
716
  
Inhibitor
Name:
BDBM277931
Synonyms:
(R)-2-((3,3-difluoro-1-(2- hydroxyacetyl)piperidin-4- yl)oxy)-5-(4-((4-(4-(oxetan- 3-yl)piperazin-1- yl)phenyl)amino)-1,3,5- triazin-2-yl)benzonitrile US10253019, Example 153
Type:
Small organic molecule
Emp. Form.:
C30H32F2N8O4
Mol. Mass.:
606.6231
SMILES:
OCC(=O)N1CC[C@@H](Oc2ccc(cc2C#N)-c2ncnc(Nc3ccc(cc3)N3CCN(CC3)C3COC3)n2)C(F)(F)C1
: