Target
Serine/threonine-protein kinase TBK1
Ligand
BDBM277936
Substrate
Meas. Tech.
Biological Assays for TBK1 and IKKe
IC50
1.000±n/a nM
Citation
 Du, ZGuerrero, JAKaplan, JAKnox, Jr., JELo, JRMitchell, SANaduthambi, DPhillips, BWVenkataramani, CWang, PWatkins, WJZhao, Z Tank-binding kinase inhibitor compounds US Patent  US10253019 Publication Date 4/9/2019 
Target
Name:
Serine/threonine-protein kinase TBK1
Synonyms:
NAK Protein cereblon/Serine/threonine-protein kinase TBK1 TANK-binding kinase 1 (TBK-1) TBK1 | TBK1_HUMAN
Type:
protein
Mol. Mass.:
83645.20
Organism:
Homo sapiens (Human)
Description:
Q9UHD2
Residue:
729
  
Inhibitor
Name:
BDBM277936
Synonyms:
2-(((S)-3,3-difluoro-1-((R)-2- hydroxypropanoyl)piperidin- 4-yl)oxy)-5-(4-((4-(4- (oxetan-3-yl)piperazin-1- yl)phenyl)amino)-1,3,5- triazin-2-yl)benzonitrile US10253019, Example 158
Type:
Small organic molecule
Emp. Form.:
C31H34F2N8O4
Mol. Mass.:
620.6497
SMILES:
C[C@@H](O)C(=O)N1CC[C@H](Oc2ccc(cc2C#N)-c2ncnc(Nc3ccc(cc3)N3CCN(CC3)C3COC3)n2)C(F)(F)C1
: