Target
Serine/threonine-protein kinase TBK1
Ligand
BDBM277979
Substrate
Meas. Tech.
Biological Assays for TBK1 and IKKe
IC50
1.000±n/a nM
Citation
 Du, ZGuerrero, JAKaplan, JAKnox, Jr., JELo, JRMitchell, SANaduthambi, DPhillips, BWVenkataramani, CWang, PWatkins, WJZhao, Z Tank-binding kinase inhibitor compounds US Patent  US10253019 Publication Date 4/9/2019 
Target
Name:
Serine/threonine-protein kinase TBK1
Synonyms:
NAK Protein cereblon/Serine/threonine-protein kinase TBK1 TANK-binding kinase 1 (TBK-1) TBK1 | TBK1_HUMAN
Type:
protein
Mol. Mass.:
83645.20
Organism:
Homo sapiens (Human)
Description:
Q9UHD2
Residue:
729
  
Inhibitor
Name:
BDBM277979
Synonyms:
(S)-2-(3-fluoropyrrolidin-1-yl)-5-(4-((4-(4-(oxetan-3-yl)piperazin-1-yl)phenyl)amino)-1,3,5-triazin-2-yl)benzonitrile US10253019, Example 201
Type:
Small organic molecule
Emp. Form.:
C27H29FN8O
Mol. Mass.:
500.5706
SMILES:
F[C@H]1CCN(C1)c1ccc(cc1C#N)-c1ncnc(Nc2ccc(cc2)N2CCN(CC2)C2COC2)n1
: