Target
Inhibitor of nuclear factor kappa-B kinase subunit epsilon
Ligand
BDBM278039
Substrate
Meas. Tech.
Biological Assays for TBK1 and IKKe
IC50
<1±n/a nM
Comments
0.000 12/22/2021
Citation
 Du, ZGuerrero, JAKaplan, JAKnox, Jr., JELo, JRMitchell, SANaduthambi, DPhillips, BWVenkataramani, CWang, PWatkins, WJZhao, Z Tank-binding kinase inhibitor compounds US Patent  US10253019 Publication Date 4/9/2019 
Target
Name:
Inhibitor of nuclear factor kappa-B kinase subunit epsilon
Synonyms:
I kappa-B kinase epsilon I-kappa-B kinase epsilon (IKK-E) IKBKE IKK-epsilon IKKE IKKI KIAA0151 | von Hippel-Lindau disease tumor suppressor/Inhibitor of nuclear factor kappa-B kinase subunit epsilon
Type:
Serine/threonine-protein kinase
Mol. Mass.:
80475.98
Organism:
Homo sapiens (Human)
Description:
Kinase inhibitory activity was determined using recombinant human IKK-epsilon expressed in baculovirus as a FLAG-tagged fusion protein.
Residue:
716
  
Inhibitor
Name:
BDBM278039
Synonyms:
2-(((S)-3,3-difluoro-1-(2-hydroxyacetyl)piperidin-4-yl)oxy)-5-(4-((4-((S)-3-methyl-4-(oxetan-3-yl)piperazin-1-yl)phenyl)amino)-1,3,5-triazin-2-yl)benzonitrile US10253019, Example 261
Type:
Small organic molecule
Emp. Form.:
C31H34F2N8O4
Mol. Mass.:
620.6497
SMILES:
C[C@H]1CN(CCN1C1COC1)c1ccc(Nc2ncnc(n2)-c2ccc(O[C@H]3CCN(CC3(F)F)C(=O)CO)c(c2)C#N)cc1
: