Target
Inhibitor of nuclear factor kappa-B kinase subunit epsilon
Ligand
BDBM278178
Substrate
Meas. Tech.
Biological Assays for TBK1 and IKKe
IC50
1.000±n/a nM
Citation
 Du, ZGuerrero, JAKaplan, JAKnox, Jr., JELo, JRMitchell, SANaduthambi, DPhillips, BWVenkataramani, CWang, PWatkins, WJZhao, Z Tank-binding kinase inhibitor compounds US Patent  US10253019 Publication Date 4/9/2019 
Target
Name:
Inhibitor of nuclear factor kappa-B kinase subunit epsilon
Synonyms:
I kappa-B kinase epsilon I-kappa-B kinase epsilon (IKK-E) IKBKE IKK-epsilon IKKE IKKI KIAA0151 | von Hippel-Lindau disease tumor suppressor/Inhibitor of nuclear factor kappa-B kinase subunit epsilon
Type:
Serine/threonine-protein kinase
Mol. Mass.:
80475.98
Organism:
Homo sapiens (Human)
Description:
Kinase inhibitory activity was determined using recombinant human IKK-epsilon expressed in baculovirus as a FLAG-tagged fusion protein.
Residue:
716
  
Inhibitor
Name:
BDBM278178
Synonyms:
2-(((3R,4S)-3-fluoro-1-((S)-2-hydroxypropanoyl)piperidin-4-yl)oxy)-5-(4-((4-(((3R,4S)-3-fluoro-1-methylpiperidin-4-yl)oxy)phenyl)amino)-1,3,5-triazin-2-yl)benzonitrile US10253019, Example 400
Type:
Small organic molecule
Emp. Form.:
C30H33F2N7O4
Mol. Mass.:
593.6243
SMILES:
C[C@H](O)C(=O)N1CC[C@H](Oc2ccc(cc2C#N)-c2ncnc(Nc3ccc(O[C@H]4CCN(C)C[C@H]4F)cc3)n2)[C@H](F)C1
: