Target
Inhibitor of nuclear factor kappa-B kinase subunit epsilon
Ligand
BDBM278257
Substrate
Meas. Tech.
Biological Assays for TBK1 and IKKe
IC50
1.000±n/a nM
Citation
 Du, ZGuerrero, JAKaplan, JAKnox, Jr., JELo, JRMitchell, SANaduthambi, DPhillips, BWVenkataramani, CWang, PWatkins, WJZhao, Z Tank-binding kinase inhibitor compounds US Patent  US10253019 Publication Date 4/9/2019 
Target
Name:
Inhibitor of nuclear factor kappa-B kinase subunit epsilon
Synonyms:
I kappa-B kinase epsilon I-kappa-B kinase epsilon (IKK-E) IKBKE IKK-epsilon IKKE IKKI KIAA0151 | von Hippel-Lindau disease tumor suppressor/Inhibitor of nuclear factor kappa-B kinase subunit epsilon
Type:
Serine/threonine-protein kinase
Mol. Mass.:
80475.98
Organism:
Homo sapiens (Human)
Description:
Kinase inhibitory activity was determined using recombinant human IKK-epsilon expressed in baculovirus as a FLAG-tagged fusion protein.
Residue:
716
  
Inhibitor
Name:
BDBM278257
Synonyms:
2-(((S)-1-((S)-2,3-dihydroxypropanoyl)-3,3-difluoropiperidin-4-yl)oxy)-5-(4-((2-methoxypyridin-4-yl)amino)-1,3,5-triazin-2-yl)benzonitrile US10253019, Example 479
Type:
Small organic molecule
Emp. Form.:
C24H23F2N7O5
Mol. Mass.:
527.4801
SMILES:
COc1cc(Nc2ncnc(n2)-c2ccc(O[C@H]3CCN(CC3(F)F)C(=O)[C@@H](O)CO)c(c2)C#N)ccn1
: