Target
Inhibitor of nuclear factor kappa-B kinase subunit epsilon
Ligand
BDBM278266
Substrate
Meas. Tech.
Biological Assays for TBK1 and IKKe
IC50
1.000±n/a nM
Citation
 Du, ZGuerrero, JAKaplan, JAKnox, Jr., JELo, JRMitchell, SANaduthambi, DPhillips, BWVenkataramani, CWang, PWatkins, WJZhao, Z Tank-binding kinase inhibitor compounds US Patent  US10253019 Publication Date 4/9/2019 
Target
Name:
Inhibitor of nuclear factor kappa-B kinase subunit epsilon
Synonyms:
I kappa-B kinase epsilon I-kappa-B kinase epsilon (IKK-E) IKBKE IKK-epsilon IKKE IKKI KIAA0151 | von Hippel-Lindau disease tumor suppressor/Inhibitor of nuclear factor kappa-B kinase subunit epsilon
Type:
Serine/threonine-protein kinase
Mol. Mass.:
80475.98
Organism:
Homo sapiens (Human)
Description:
Kinase inhibitory activity was determined using recombinant human IKK-epsilon expressed in baculovirus as a FLAG-tagged fusion protein.
Residue:
716
  
Inhibitor
Name:
BDBM278266
Synonyms:
2-(((3R,4S)-1-(2-cyanoacetyl)-3-fluoropiperidin-4-yl)oxy)-5-(4-((3-methyl-4-(1-methylpiperidin-4-yl)phenyl)amino)-1,3,5-triazin-2-yl)benzonitrile US10253019, Example 488
Type:
Small organic molecule
Emp. Form.:
C31H33FN8O2
Mol. Mass.:
568.6445
SMILES:
CN1CCC(CC1)c1ccc(Nc2ncnc(n2)-c2ccc(O[C@H]3CCN(C[C@H]3F)C(=O)CC#N)c(c2)C#N)cc1C
: