Target
Inhibitor of nuclear factor kappa-B kinase subunit epsilon
Ligand
BDBM278297
Substrate
Meas. Tech.
Biological Assays for TBK1 and IKKe
IC50
1.000±n/a nM
Citation
 Du, ZGuerrero, JAKaplan, JAKnox, Jr., JELo, JRMitchell, SANaduthambi, DPhillips, BWVenkataramani, CWang, PWatkins, WJZhao, Z Tank-binding kinase inhibitor compounds US Patent  US10253019 Publication Date 4/9/2019 
Target
Name:
Inhibitor of nuclear factor kappa-B kinase subunit epsilon
Synonyms:
I kappa-B kinase epsilon I-kappa-B kinase epsilon (IKK-E) IKBKE IKK-epsilon IKKE IKKI KIAA0151 | von Hippel-Lindau disease tumor suppressor/Inhibitor of nuclear factor kappa-B kinase subunit epsilon
Type:
Serine/threonine-protein kinase
Mol. Mass.:
80475.98
Organism:
Homo sapiens (Human)
Description:
Kinase inhibitory activity was determined using recombinant human IKK-epsilon expressed in baculovirus as a FLAG-tagged fusion protein.
Residue:
716
  
Inhibitor
Name:
BDBM278297
Synonyms:
2-(((S)-3,3-difluoro-1-((S)-2-oxooxazolidine-4-carbonyl)piperidin-4-yl)oxy)-5-(4-((4-(4-(oxetan-3-yl)piperazin-1-yl)phenyl)amino)-1,3,5-triazin-2-yl)benzonitrile US10253019, Example 519
Type:
Small organic molecule
Emp. Form.:
C32H33F2N9O5
Mol. Mass.:
661.6585
SMILES:
FC1(F)CN(CC[C@@H]1Oc1ccc(cc1C#N)-c1ncnc(Nc2ccc(cc2)N2CCN(CC2)C2COC2)n1)C(=O)[C@@H]1COC(=O)N1
: