Target
Serine/threonine-protein kinase PLK4
Ligand
BDBM375403
Substrate
Meas. Tech.
Inhibition Assay
IC50
<100±n/a nM
Citation
 Sampson, PBLiu, YLi, SForrest, BTPauls, HWEdwards, LGFeher, MPatel, NKLaufer, R Kinase inhibitors and method of treating cancer US Patent  US9907800 Publication Date 3/6/2018 
Target
Name:
Serine/threonine-protein kinase PLK4
Synonyms:
PLK4 Polo-Like Kinase 4 STK18 | Serine/threonine-protein kinase PLK4
Type:
PROTEIN
Mol. Mass.:
108996.91
Organism:
Homo sapiens (Human)
Description:
ChEMBL_1474078
Residue:
970
  
Inhibitor
Name:
BDBM375403
Synonyms:
US10358436, Example A120 US9907800, Example A120
Type:
Small organic molecule
Emp. Form.:
C31H33N5O2
Mol. Mass.:
507.626
SMILES:
COc1ccc2NC(=O)[C@@]3(C[C@H]3c3ccc4c(n[nH]c4c3)-c3ccc(cc3)N3CCC(CC3)N(C)C)c2c1
: