Target
Tyrosine-protein kinase BTK
Ligand
BDBM375281
Substrate
Meas. Tech.
Inhibition Assay
IC50
459±n/a nM
Citation
 Treon, SPBuhrlage, SJGray, NSTan, LYang, G Methods to treat lymphoplasmacytic lymphoma US Patent  US9908872 Publication Date 3/6/2018 
Target
Name:
Tyrosine-protein kinase BTK
Synonyms:
AGMX1 Agammaglobulinaemia tyrosine kinase B cell progenitor kinase BPK BTK_HUMAN Tyrosine Kinase BTK Tyrosine-protein kinase BTK (BTK)
Type:
Enzyme
Mol. Mass.:
76289.95
Organism:
Homo sapiens (Human)
Description:
Q06187
Residue:
659
  
Inhibitor
Name:
BDBM375281
Synonyms:
US10597387, Compound (I-4) | US9908872, Compound (I-4)
Type:
Small organic molecule
Emp. Form.:
C30H28F3N5O2S
Mol. Mass.:
579.636
SMILES:
CN1CCN(CC1)c1cc(NC(=O)c2ccc(C)c(NC(=O)c3cncc(c3)-c3cccs3)c2)cc(c1)C(F)(F)F
: