Target
MAP kinase-interacting serine/threonine-protein kinase 1
Ligand
BDBM375537
Substrate
Meas. Tech.
In Vitro Kinase Assay
IC50
<100.0±n/a nM
Citation
 Nacro, KDuraiswamy, AJChennamaneni, LR Bicyclic heterocyclic derivatives as MNK1 and MNK2 modulators and uses thereof US Patent  US9908886 Publication Date 3/6/2018 
Target
Name:
MAP kinase-interacting serine/threonine-protein kinase 1
Synonyms:
MAP Kinase-Interacting Protein Kinase (MNK1) MAP kinase-interacting serine/threonine-protein kinase 1 (MnK1) MAP-kinase interacting kinase 1 (MNK1) MKNK1 MNK1
Type:
Serine/threonine-protein kinase
Mol. Mass.:
51342.85
Organism:
Homo sapiens (Human)
Description:
Q9BUB5
Residue:
465
  
Inhibitor
Name:
BDBM375537
Synonyms:
N-(5-(3-(4-cyanophenyl)imidazo[1,2-b]pyridazin-6-yl)-2-(4-(dimethylamino)piperidine-1-carbonyl)phenyl)acetamide | US9908886, Example 81
Type:
Small organic molecule
Emp. Form.:
C22H25IN6O2
Mol. Mass.:
532.3774
SMILES:
CN(C)C1CCN(CC1)C(=O)c1ccc(cc1NC(C)=O)-c1ccc2ncc(I)n2n1
: