Target
MAP kinase-interacting serine/threonine-protein kinase 1
Ligand
BDBM375540
Substrate
Meas. Tech.
In Vitro Kinase Assay
IC50
<100.0±n/a nM
Citation
 Nacro, KDuraiswamy, AJChennamaneni, LR Bicyclic heterocyclic derivatives as MNK1 and MNK2 modulators and uses thereof US Patent  US9908886 Publication Date 3/6/2018 
Target
Name:
MAP kinase-interacting serine/threonine-protein kinase 1
Synonyms:
MAP Kinase-Interacting Protein Kinase (MNK1) MAP kinase-interacting serine/threonine-protein kinase 1 (MnK1) MAP-kinase interacting kinase 1 (MNK1) MKNK1 MNK1
Type:
Serine/threonine-protein kinase
Mol. Mass.:
51342.85
Organism:
Homo sapiens (Human)
Description:
Q9BUB5
Residue:
465
  
Inhibitor
Name:
BDBM375540
Synonyms:
(4-(3-(1H-benzo[d]imidazol-5-yl)imidazo[1,2-b]pyridazin-6-yl)phenyl)(4-methylpiperazin-1-yl)methanone | US9908886, Example 87
Type:
Small organic molecule
Emp. Form.:
C25H23N7O
Mol. Mass.:
437.4964
SMILES:
CN1CCN(CC1)C(=O)c1ccc(cc1)-c1ccc2ncc(-c3ccc4[nH]cnc4c3)n2n1
: