Target
MAP kinase-interacting serine/threonine-protein kinase 1
Ligand
BDBM375550
Substrate
Meas. Tech.
In Vitro Kinase Assay
IC50
<100.0±n/a nM
Citation
 Nacro, KDuraiswamy, AJChennamaneni, LR Bicyclic heterocyclic derivatives as MNK1 and MNK2 modulators and uses thereof US Patent  US9908886 Publication Date 3/6/2018 
Target
Name:
MAP kinase-interacting serine/threonine-protein kinase 1
Synonyms:
MAP Kinase-Interacting Protein Kinase (MNK1) MAP kinase-interacting serine/threonine-protein kinase 1 (MnK1) MAP-kinase interacting kinase 1 (MNK1) MKNK1 MNK1
Type:
Serine/threonine-protein kinase
Mol. Mass.:
51342.85
Organism:
Homo sapiens (Human)
Description:
Q9BUB5
Residue:
465
  
Inhibitor
Name:
BDBM375550
Synonyms:
4-(3-(4-cyanophenyl)imidazo[1,2-a]pyridin-6-yl)-N-methyl-N-(2-morpholino-2-oxoethyl)benzamide | US9908886, Example 101
Type:
Small organic molecule
Emp. Form.:
C28H25N5O3
Mol. Mass.:
479.5298
SMILES:
CN(CC(=O)N1CCOCC1)C(=O)c1ccc(cc1)-c1ccc2ncc(-c3ccc(cc3)C#N)n2c1
: