Target
MAP kinase-interacting serine/threonine-protein kinase 2
Ligand
BDBM375555
Substrate
Meas. Tech.
In Vitro Kinase Assay
IC50
<100.0±n/a nM
Citation
 Nacro, KDuraiswamy, AJChennamaneni, LR Bicyclic heterocyclic derivatives as MNK1 and MNK2 modulators and uses thereof US Patent  US9908886 Publication Date 3/6/2018 
Target
Name:
MAP kinase-interacting serine/threonine-protein kinase 2
Synonyms:
GPRK7 MAP kinase-interacting serine/threonine-protein kinase 2 (MKNK2) MAP-kinase interacting kinase 2 (MNK2) MKNK2_HUMAN | MNK2
Type:
Protein
Mol. Mass.:
51870.79
Organism:
Homo sapiens (Human)
Description:
Q9HBH9
Residue:
465
  
Inhibitor
Name:
BDBM375555
Synonyms:
4-(6-(4-(1,4-diazepane-1-carbonyl)phenyl)imidazo[1,2-a]pyridin-3-yl)benzonitrile | US9908886, Example 107
Type:
Small organic molecule
Emp. Form.:
C26H23N5O
Mol. Mass.:
421.4937
SMILES:
O=C(N1CCCNCC1)c1ccc(cc1)-c1ccc2ncc(-c3ccc(cc3)C#N)n2c1
: