Target
MAP kinase-interacting serine/threonine-protein kinase 2
Ligand
BDBM375563
Substrate
Meas. Tech.
In Vitro Kinase Assay
IC50
<100.0±n/a nM
Citation
 Nacro, KDuraiswamy, AJChennamaneni, LR Bicyclic heterocyclic derivatives as MNK1 and MNK2 modulators and uses thereof US Patent  US9908886 Publication Date 3/6/2018 
Target
Name:
MAP kinase-interacting serine/threonine-protein kinase 2
Synonyms:
GPRK7 MAP kinase-interacting serine/threonine-protein kinase 2 (MKNK2) MAP-kinase interacting kinase 2 (MNK2) MKNK2_HUMAN | MNK2
Type:
Protein
Mol. Mass.:
51870.79
Organism:
Homo sapiens (Human)
Description:
Q9HBH9
Residue:
465
  
Inhibitor
Name:
BDBM375563
Synonyms:
4-(6-(4-(1-acetyl-1,9-diazaspiro[5.5]undecane-9-carbonyl)phenyl)imidazo[1,2-a]pyridin-3-yl)benzonitrile | US9908886, Example 118
Type:
Small organic molecule
Emp. Form.:
C32H31N5O2
Mol. Mass.:
517.6208
SMILES:
CC(=O)N1CCCCC11CCN(CC1)C(=O)c1ccc(cc1)-c1ccc2ncc(-c3ccc(cc3)C#N)n2c1
: