Target
Sodium channel protein type 9 subunit alpha
Ligand
BDBM71258
Substrate
Meas. Tech.
Radioligand Binding Assay
pH
7.4±n/a
Temperature
298.15±n/a K
IC50
2.2±n/a nM
Comments
extracted
Citation
 Andrez, JBichler, PRChen, CChowdhury, SDecker, SMDehnhardt, CMFocken, TGrimwood, MEHemeon, IWJia, QLi, JLiu, ZOrtwine, DFSafina, BSutherlin, DSheng, TSun, SWhite, ADWilson, MSZenova, AYZhu, J Substituted benzamides and methods of use thereof US Patent  US9694002 Publication Date 7/4/2017 
Target
Name:
Sodium channel protein type 9 subunit alpha
Synonyms:
NENA Peripheral sodium channel 1 SCN9A_HUMAN Voltage-gated sodium channel subunit Nav1.7 hNE-Na
Type:
Protein
Mol. Mass.:
226375.97
Organism:
Homo sapiens (Human)
Description:
Q15858
Residue:
1988
  
Inhibitor
Name:
BDBM71258
Synonyms:
US9546164, 346 | US9694002, 346
Type:
Small organic molecule
Emp. Form.:
C25H25ClF6N2O4S
Mol. Mass.:
598.985
SMILES:
CS(=O)(=O)NC(=O)c1cc(C2CC2)c(OCC2(F)CCN(Cc3cc(cc(Cl)c3F)C(F)(F)F)CC2)cc1F
: