Target
Sodium channel protein type 9 subunit alpha
Ligand
BDBM71429
Substrate
Meas. Tech.
Radioligand Binding Assay
pH
7.4±n/a
Temperature
298.15±n/a K
IC50
1.8±n/a nM
Comments
extracted
Citation
 Andrez, JBichler, PRChen, CChowdhury, SDecker, SMDehnhardt, CMFocken, TGrimwood, MEHemeon, IWJia, QLi, JLiu, ZOrtwine, DFSafina, BSutherlin, DSheng, TSun, SWhite, ADWilson, MSZenova, AYZhu, J Substituted benzamides and methods of use thereof US Patent  US9694002 Publication Date 7/4/2017 
Target
Name:
Sodium channel protein type 9 subunit alpha
Synonyms:
NENA Peripheral sodium channel 1 SCN9A_HUMAN Voltage-gated sodium channel subunit Nav1.7 hNE-Na
Type:
Protein
Mol. Mass.:
226375.97
Organism:
Homo sapiens (Human)
Description:
Q15858
Residue:
1988
  
Inhibitor
Name:
BDBM71429
Synonyms:
US9694002, 475
Type:
Small organic molecule
Emp. Form.:
C27H29Cl2FN2O4S
Mol. Mass.:
567.5
SMILES:
Fc1cc(CN2[C@H]3CC[C@@H]2CC(C3)Oc2cc(Cl)cc(Cl)c2)c(cc1C(=O)NS(=O)(=O)C1CC1)C1CC1
: