Target
Tyrosine-protein kinase SYK
Ligand
BDBM375946
Substrate
Meas. Tech.
Syk Kinase Assay
IC50
12.3±n/a nM
Citation
 Dahmann, GHoffmann, MKlicic, JLamb, DJMcCarthy, CNapier, SCParrish, KScott, JFitzgerald, JLWalker, E Heteroaryl Syk inhibitors US Patent  US9914735 Publication Date 3/13/2018 
Target
Name:
Tyrosine-protein kinase SYK
Synonyms:
KSYK_HUMAN Spleen Tyrosine Kinase Tyrosine-protein kinase SYK (Syk)
Type:
Enzyme
Mol. Mass.:
72079.99
Organism:
Homo sapiens (Human)
Description:
P43405
Residue:
635
  
Inhibitor
Name:
BDBM375946
Synonyms:
US10947243, Example 12 | US9914735, Example 12
Type:
Small organic molecule
Emp. Form.:
C27H36N8O3
Mol. Mass.:
520.6265
SMILES:
C[C@@H](Oc1nc(cc2nn(C)cc12)-c1cnn(c1)[C@H]1CC[C@@H](CC1)N1CCN(C)C(=O)C1)[C@H]1CNC(=O)C1
: