Target
Tyrosine-protein kinase SYK
Ligand
BDBM375950
Substrate
Meas. Tech.
Syk Kinase Assay
IC50
6.50±n/a nM
Citation
 Dahmann, GHoffmann, MKlicic, JLamb, DJMcCarthy, CNapier, SCParrish, KScott, JFitzgerald, JLWalker, E Heteroaryl Syk inhibitors US Patent  US9914735 Publication Date 3/13/2018 
Target
Name:
Tyrosine-protein kinase SYK
Synonyms:
KSYK_HUMAN Spleen Tyrosine Kinase Tyrosine-protein kinase SYK (Syk)
Type:
Enzyme
Mol. Mass.:
72079.99
Organism:
Homo sapiens (Human)
Description:
P43405
Residue:
635
  
Inhibitor
Name:
BDBM375950
Synonyms:
US10947243, Example 16 | US9914735, Example 16
Type:
Small organic molecule
Emp. Form.:
C22H20N6O2
Mol. Mass.:
400.4332
SMILES:
C[C@@H](Oc1cc(cc2nn(C)cc12)-c1n[nH]c2ccc(cc12)C#N)[C@H]1CNC(=O)C1
: