Target
Tyrosine-protein kinase SYK
Ligand
BDBM375974
Substrate
Meas. Tech.
Syk Kinase Assay
IC50
13.9±n/a nM
Citation
 Dahmann, GHoffmann, MKlicic, JLamb, DJMcCarthy, CNapier, SCParrish, KScott, JFitzgerald, JLWalker, E Heteroaryl Syk inhibitors US Patent  US9914735 Publication Date 3/13/2018 
Target
Name:
Tyrosine-protein kinase SYK
Synonyms:
KSYK_HUMAN Spleen Tyrosine Kinase Tyrosine-protein kinase SYK (Syk)
Type:
Enzyme
Mol. Mass.:
72079.99
Organism:
Homo sapiens (Human)
Description:
P43405
Residue:
635
  
Inhibitor
Name:
BDBM375974
Synonyms:
US10947243, Example 53 | US9914735, Example 53
Type:
Small organic molecule
Emp. Form.:
C22H23N5O3
Mol. Mass.:
405.4497
SMILES:
COc1ccc2[nH]cc(-c3cc4nn(C)cc4c(O[C@H](C)[C@H]4CNC(=O)C4)n3)c2c1
: