Target
Tyrosine-protein kinase SYK
Ligand
BDBM375992
Substrate
Meas. Tech.
Syk Kinase Assay
IC50
15.0±n/a nM
Citation
 Dahmann, GHoffmann, MKlicic, JLamb, DJMcCarthy, CNapier, SCParrish, KScott, JFitzgerald, JLWalker, E Heteroaryl Syk inhibitors US Patent  US9914735 Publication Date 3/13/2018 
Target
Name:
Tyrosine-protein kinase SYK
Synonyms:
KSYK_HUMAN Spleen Tyrosine Kinase Tyrosine-protein kinase SYK (Syk)
Type:
Enzyme
Mol. Mass.:
72079.99
Organism:
Homo sapiens (Human)
Description:
P43405
Residue:
635
  
Inhibitor
Name:
BDBM375992
Synonyms:
US10947243, Example 71 | US9914735, Example 71
Type:
Small organic molecule
Emp. Form.:
C23H27N5O4S
Mol. Mass.:
469.557
SMILES:
C[C@@H](Oc1nc(cc2nn(C)cc12)-c1ccc(N2CCCS2(=O)=O)c(C)c1)[C@H]1CNC(=O)C1
: