Target
Tyrosine-protein kinase SYK
Ligand
BDBM375952
Substrate
Meas. Tech.
GSK Kinase Assay
IC50
4.60±n/a nM
Citation
 Dahmann, GHoffmann, MKlicic, JLamb, DJMcCarthy, CNapier, SCParrish, KScott, JFitzgerald, JLWalker, E Heteroaryl Syk inhibitors US Patent  US9914735 Publication Date 3/13/2018 
Target
Name:
Tyrosine-protein kinase SYK
Synonyms:
KSYK_HUMAN Spleen Tyrosine Kinase Tyrosine-protein kinase SYK (Syk)
Type:
Enzyme
Mol. Mass.:
72079.99
Organism:
Homo sapiens (Human)
Description:
P43405
Residue:
635
  
Inhibitor
Name:
BDBM375952
Synonyms:
US10947243, Example 18 | US9914735, Example 18
Type:
Small organic molecule
Emp. Form.:
C21H27N5O2
Mol. Mass.:
381.4714
SMILES:
C[C@@H](Oc1cc(cc2nn(C)cc12)-c1cnn(c1)C(C)(C)C)[C@H]1CNC(=O)C1
: