Target
Tyrosine-protein kinase SYK
Ligand
BDBM140389
Substrate
Meas. Tech.
GSK Kinase Assay
IC50
0.200±n/a nM
Citation
 Dahmann, GHoffmann, MKlicic, JLamb, DJMcCarthy, CNapier, SCParrish, KScott, JFitzgerald, JLWalker, E Heteroaryl Syk inhibitors US Patent  US9914735 Publication Date 3/13/2018 
Target
Name:
Tyrosine-protein kinase SYK
Synonyms:
KSYK_HUMAN Spleen Tyrosine Kinase Tyrosine-protein kinase SYK (Syk)
Type:
Enzyme
Mol. Mass.:
72079.99
Organism:
Homo sapiens (Human)
Description:
P43405
Residue:
635
  
Inhibitor
Name:
BDBM140389
Synonyms:
US10947243, Example 114 US9914735, Example 114
Type:
Small organic molecule
Emp. Form.:
C21H24N4O2
Mol. Mass.:
364.4409
SMILES:
CCCn1cc(cn1)-c1cc(O[C@H](C)[C@H]2CNC(=O)C2)c2cccnc2c1
: