Target
Tyrosine-protein kinase SYK
Ligand
BDBM375957
Substrate
Meas. Tech.
GSK Kinase Assay
IC50
2.00±n/a nM
Citation
 Dahmann, GHoffmann, MKlicic, JLamb, DJMcCarthy, CNapier, SCParrish, KScott, JFitzgerald, JLWalker, E Heteroaryl Syk inhibitors US Patent  US9914735 Publication Date 3/13/2018 
Target
Name:
Tyrosine-protein kinase SYK
Synonyms:
KSYK_HUMAN Spleen Tyrosine Kinase Tyrosine-protein kinase SYK (Syk)
Type:
Enzyme
Mol. Mass.:
72079.99
Organism:
Homo sapiens (Human)
Description:
P43405
Residue:
635
  
Inhibitor
Name:
BDBM375957
Synonyms:
US10947243, Example 29 | US9914735, Example 29
Type:
Small organic molecule
Emp. Form.:
C17H18N4O2S
Mol. Mass.:
342.415
SMILES:
C[C@@H](Oc1cc(cc2nn(C)cc12)-c1cscn1)[C@H]1CNC(=O)C1
: