Target
Tyrosine-protein kinase SYK
Ligand
BDBM375982
Substrate
Meas. Tech.
GSK Kinase Assay
IC50
2.00±n/a nM
Citation
 Dahmann, GHoffmann, MKlicic, JLamb, DJMcCarthy, CNapier, SCParrish, KScott, JFitzgerald, JLWalker, E Heteroaryl Syk inhibitors US Patent  US9914735 Publication Date 3/13/2018 
Target
Name:
Tyrosine-protein kinase SYK
Synonyms:
KSYK_HUMAN Spleen Tyrosine Kinase Tyrosine-protein kinase SYK (Syk)
Type:
Enzyme
Mol. Mass.:
72079.99
Organism:
Homo sapiens (Human)
Description:
P43405
Residue:
635
  
Inhibitor
Name:
BDBM375982
Synonyms:
US10947243, Example 61 | US9914735, Example 61
Type:
Small organic molecule
Emp. Form.:
C19H18F3N5O2
Mol. Mass.:
405.3737
SMILES:
C[C@@H](Oc1nc(cc2nn(C)cc12)-c1ccc(nc1)C(F)(F)F)[C@H]1CNC(=O)C1
: