Target
Tyrosine-protein kinase SYK
Ligand
BDBM140384
Substrate
Meas. Tech.
GSK Kinase Assay
IC50
1.000±n/a nM
Citation
 Dahmann, GHoffmann, MKlicic, JLamb, DJMcCarthy, CNapier, SCParrish, KScott, JFitzgerald, JLWalker, E Heteroaryl Syk inhibitors US Patent  US9914735 Publication Date 3/13/2018 
Target
Name:
Tyrosine-protein kinase SYK
Synonyms:
KSYK_HUMAN Spleen Tyrosine Kinase Tyrosine-protein kinase SYK (Syk)
Type:
Enzyme
Mol. Mass.:
72079.99
Organism:
Homo sapiens (Human)
Description:
P43405
Residue:
635
  
Inhibitor
Name:
BDBM140384
Synonyms:
US10947243, Example 109 US9914735, Example 109
Type:
Small organic molecule
Emp. Form.:
C23H22N4O2
Mol. Mass.:
386.4464
SMILES:
C[C@@H](Oc1cc(cc2ncccc12)-c1ccc2[nH]c(C)nc2c1)[C@H]1CNC(=O)C1
: