Target
Tyrosine-protein kinase SYK
Ligand
BDBM375960
Substrate
Meas. Tech.
GSK Kinase Assay
IC50
1.000±n/a nM
Citation
 Dahmann, GHoffmann, MKlicic, JLamb, DJMcCarthy, CNapier, SCParrish, KScott, JFitzgerald, JLWalker, E Heteroaryl Syk inhibitors US Patent  US9914735 Publication Date 3/13/2018 
Target
Name:
Tyrosine-protein kinase SYK
Synonyms:
KSYK_HUMAN Spleen Tyrosine Kinase Tyrosine-protein kinase SYK (Syk)
Type:
Enzyme
Mol. Mass.:
72079.99
Organism:
Homo sapiens (Human)
Description:
P43405
Residue:
635
  
Inhibitor
Name:
BDBM375960
Synonyms:
US10947243, Example 35 | US9914735, Example 35
Type:
Small organic molecule
Emp. Form.:
C18H18F2N4O2S
Mol. Mass.:
392.423
SMILES:
C[C@@H](Oc1cc(cc2nn(C)cc12)-c1csc(n1)C(F)F)[C@H]1CNC(=O)C1
: