Target
Tyrosine-protein kinase SYK
Ligand
BDBM144453
Substrate
Meas. Tech.
GSK Kinase Assay
IC50
3.00±n/a nM
Citation
 Dahmann, GHoffmann, MKlicic, JLamb, DJMcCarthy, CNapier, SCParrish, KScott, JFitzgerald, JLWalker, E Heteroaryl Syk inhibitors US Patent  US9914735 Publication Date 3/13/2018 
Target
Name:
Tyrosine-protein kinase SYK
Synonyms:
KSYK_HUMAN Spleen Tyrosine Kinase Tyrosine-protein kinase SYK (Syk)
Type:
Enzyme
Mol. Mass.:
72079.99
Organism:
Homo sapiens (Human)
Description:
P43405
Residue:
635
  
Inhibitor
Name:
BDBM144453
Synonyms:
US10947243, Example 4 US9914735, Example 4
Type:
Small organic molecule
Emp. Form.:
C22H20F3N3O4
Mol. Mass.:
447.4071
SMILES:
COc1cc(ccc1OC(F)(F)F)-c1cc2ncccc2c(O[C@H](C)[C@H]2CNC(=O)C2)n1
: