Target
Tyrosine-protein kinase SYK
Ligand
BDBM375938
Substrate
Meas. Tech.
GSK Kinase Assay
IC50
9.00±n/a nM
Citation
 Dahmann, GHoffmann, MKlicic, JLamb, DJMcCarthy, CNapier, SCParrish, KScott, JFitzgerald, JLWalker, E Heteroaryl Syk inhibitors US Patent  US9914735 Publication Date 3/13/2018 
Target
Name:
Tyrosine-protein kinase SYK
Synonyms:
KSYK_HUMAN Spleen Tyrosine Kinase Tyrosine-protein kinase SYK (Syk)
Type:
Enzyme
Mol. Mass.:
72079.99
Organism:
Homo sapiens (Human)
Description:
P43405
Residue:
635
  
Inhibitor
Name:
BDBM375938
Synonyms:
US10947243, Example 1 | US9914735, Example 1
Type:
Small organic molecule
Emp. Form.:
C21H24N4O4
Mol. Mass.:
396.4397
SMILES:
COc1ccc(cc1OC)-c1cc2nn(C)cc2c(O[C@H](C)[C@H]2CNC(=O)C2)n1
: