Target
Tyrosine-protein kinase SYK
Ligand
BDBM375942
Substrate
Meas. Tech.
GSK Kinase Assay
IC50
1.000±n/a nM
Citation
 Dahmann, GHoffmann, MKlicic, JLamb, DJMcCarthy, CNapier, SCParrish, KScott, JFitzgerald, JLWalker, E Heteroaryl Syk inhibitors US Patent  US9914735 Publication Date 3/13/2018 
Target
Name:
Tyrosine-protein kinase SYK
Synonyms:
KSYK_HUMAN Spleen Tyrosine Kinase Tyrosine-protein kinase SYK (Syk)
Type:
Enzyme
Mol. Mass.:
72079.99
Organism:
Homo sapiens (Human)
Description:
P43405
Residue:
635
  
Inhibitor
Name:
BDBM375942
Synonyms:
US10947243, Example 8 | US9914735, Example 8
Type:
Small organic molecule
Emp. Form.:
C20H22N4O4
Mol. Mass.:
382.4131
SMILES:
COc1cc(ccc1O)-c1cc2nn(C)cc2c(O[C@H](C)[C@H]2CNC(=O)C2)n1
: