Target
Tyrosine-protein kinase SYK
Ligand
BDBM375944
Substrate
Meas. Tech.
GSK Kinase Assay
IC50
1.000±n/a nM
Citation
 Dahmann, GHoffmann, MKlicic, JLamb, DJMcCarthy, CNapier, SCParrish, KScott, JFitzgerald, JLWalker, E Heteroaryl Syk inhibitors US Patent  US9914735 Publication Date 3/13/2018 
Target
Name:
Tyrosine-protein kinase SYK
Synonyms:
KSYK_HUMAN Spleen Tyrosine Kinase Tyrosine-protein kinase SYK (Syk)
Type:
Enzyme
Mol. Mass.:
72079.99
Organism:
Homo sapiens (Human)
Description:
P43405
Residue:
635
  
Inhibitor
Name:
BDBM375944
Synonyms:
US10947243, Example 10 | US9914735, Example 10
Type:
Small organic molecule
Emp. Form.:
C22H26F2N6O2
Mol. Mass.:
444.4776
SMILES:
C[C@@H](Oc1nc(cc2nn(C)cc12)-c1cnn(c1)C1CCC(F)(F)CC1)[C@H]1CNC(=O)C1
: