Target
Tyrosine-protein kinase SYK
Ligand
BDBM375988
Substrate
Meas. Tech.
GSK Kinase Assay
IC50
15.2±n/a nM
Citation
 Dahmann, GHoffmann, MKlicic, JLamb, DJMcCarthy, CNapier, SCParrish, KScott, JFitzgerald, JLWalker, E Heteroaryl Syk inhibitors US Patent  US9914735 Publication Date 3/13/2018 
Target
Name:
Tyrosine-protein kinase SYK
Synonyms:
KSYK_HUMAN Spleen Tyrosine Kinase Tyrosine-protein kinase SYK (Syk)
Type:
Enzyme
Mol. Mass.:
72079.99
Organism:
Homo sapiens (Human)
Description:
P43405
Residue:
635
  
Inhibitor
Name:
BDBM375988
Synonyms:
US10947243, Example 67 | US9914735, Example 67
Type:
Small organic molecule
Emp. Form.:
C24H30N6O2
Mol. Mass.:
434.534
SMILES:
C[C@@H](Oc1nc(cc2nn(C)cc12)-c1ccc(cc1)N1CCN(C)CC1)[C@H]1CNC(=O)C1
: